{"text_format":"1","workbook":"xlsx","n_sheets":5,"sheets":["Metadata","Charts","Chart data","Males","Females"],"not_rendered":{"charts":2,"images":0,"macros":1,"external_links":1,"defined_names":2,"comments":0,"pivot_tables":0},"unopened":[{"sheet":"Charts","index":1,"reason":"not_a_worksheet"}],"bounds":{"document_bytes":16777216,"sheet_cells":100000,"rows_first":2000,"rows_last":500,"rows_between":2000,"halvings":0,"cell_chars":16384,"cell_head_chars":4096},"cells_cut":0,"cells_raw":0,"read":"whole","date_system":"1900"}

{"sheet":"Metadata","index":0,"n_rows":23,"n_cols":2,"rows_kept":23,"cut":false,"hidden":false,"merged":[[0,0,0,3],[13,0,14,11],[16,0,17,11],[19,0,20,11],[4,1,4,6],[8,1,8,6],[7,1,7,6],[6,1,6,6],[5,1,5,6],[10,0,11,11],[12,0,12,11],[15,0,15,11],[18,0,18,11]]}
["Population Pyramids of Scotland, 1981-2043"]
[]
["General details"]
[]
["Dataset title:","Population Pyramids of Scotland, 1981-2043"]
["Time period of dataset:","1981-2043"]
["Geographic coverage:","Scotland"]
["Supplier:","National Records of Scotland (NRS)"]
["Department:","Demography Division, Population and Migration Statistics Branch"]
[]
["These charts show the age and sex structure of the population of Scotland, and how it has changed, and is projected to change over time. Using the scroll bar to the right of the chart you can move through the years and see the changes."]
[]
[]
["The estimated data, for the period 1981-2018, is taken from the National Records of Scotland (NRS) Mid-Year Population Estimates. This data can be accessed from the Mid-Year Population Estimates section of the NRS website."]
[]
[]
["The projected data, for the period 2019-2043, is from the Projected Population of Scotland (2018-based). This data can be accessed from the Population Projections Scotland section of the NRS website."]
[]
[]
["Information on the methodology of the estimates and projections is available on the website within the relevant sections and can be accessed from the above links."]
{"$rows_left_out":4}
{"sheet":"Chart data","index":2,"n_rows":96,"n_cols":12,"rows_kept":96,"cut":false,"hidden":false,"merged":[[95,0,95,2],[0,2,0,5],[0,6,0,7]]}
["Code",0,"Population pyramids of Scotland",null,null,null,"Chart sequence speed",null,{"$f":"IF(L1=1,1200,IF(L1=2,400,80))","v":80},null,"Slow",3]
[null,null,"Year",{"$f":"OFFSET($A$4,B1,0)","v":1981},null,null,null,null,"Finished",null,"Medium"]
[null,null,null,"Male","Female",null,null,null,null,null,"Fast"]
[1981,1,0,{"$f":"-VLOOKUP($D$2,Males!$A$3:$CN$68,'Chart data'!B4+1,FALSE)","v":-35263},{"$f":"VLOOKUP($D$2,Females!$A$3:$CN$68,'Chart data'!B4+1,FALSE)","v":33266}]
[1982,2,1,{"$f":"-VLOOKUP($D$2,Males!$A$3:$CN$68,'Chart data'!B5+1,FALSE)","v":-34142},{"$f":"VLOOKUP($D$2,Females!$A$3:$CN$68,'Chart data'!B5+1,FALSE)","v":32581}]
[1983,3,2,{"$f":"-VLOOKUP($D$2,Males!$A$3:$CN$68,'Chart data'!B6+1,FALSE)","v":-33070},{"$f":"VLOOKUP($D$2,Females!$A$3:$CN$68,'Chart data'!B6+1,FALSE)","v":30995}]
[1984,4,3,{"$f":"-VLOOKUP($D$2,Males!$A$3:$CN$68,'Chart data'!B7+1,FALSE)","v":-30363},{"$f":"VLOOKUP($D$2,Females!$A$3:$CN$68,'Chart data'!B7+1,FALSE)","v":29205}]
[1985,5,4,{"$f":"-VLOOKUP($D$2,Males!$A$3:$CN$68,'Chart data'!B8+1,FALSE)","v":-30380},{"$f":"VLOOKUP($D$2,Females!$A$3:$CN$68,'Chart data'!B8+1,FALSE)","v":28643}]
[1986,6,5,{"$f":"-VLOOKUP($D$2,Males!$A$3:$CN$68,'Chart data'!B9+1,FALSE)","v":-33216},{"$f":"VLOOKUP($D$2,Females!$A$3:$CN$68,'Chart data'!B9+1,FALSE)","v":31299}]
[1987,7,6,{"$f":"-VLOOKUP($D$2,Males!$A$3:$CN$68,'Chart data'!B10+1,FALSE)","v":-33496},{"$f":"VLOOKUP($D$2,Females!$A$3:$CN$68,'Chart data'!B10+1,FALSE)","v":32077}]
[1988,8,7,{"$f":"-VLOOKUP($D$2,Males!$A$3:$CN$68,'Chart data'!B11+1,FALSE)","v":-34533},{"$f":"VLOOKUP($D$2,Females!$A$3:$CN$68,'Chart data'!B11+1,FALSE)","v":32738}]
[1989,9,8,{"$f":"-VLOOKUP($D$2,Males!$A$3:$CN$68,'Chart data'!B12+1,FALSE)","v":-37219},{"$f":"VLOOKUP($D$2,Females!$A$3:$CN$68,'Chart data'!B12+1,FALSE)","v":35159}]
[1990,10,9,{"$f":"-VLOOKUP($D$2,Males!$A$3:$CN$68,'Chart data'!B13+1,FALSE)","v":-39689},{"$f":"VLOOKUP($D$2,Females!$A$3:$CN$68,'Chart data'!B13+1,FALSE)","v":38287}]
[1991,11,10,{"$f":"-VLOOKUP($D$2,Males!$A$3:$CN$68,'Chart data'!B14+1,FALSE)","v":-42488},{"$f":"VLOOKUP($D$2,Females!$A$3:$CN$68,'Chart data'!B14+1,FALSE)","v":40381}]
[1992,12,11,{"$f":"-VLOOKUP($D$2,Males!$A$3:$CN$68,'Chart data'!B15+1,FALSE)","v":-42650},{"$f":"VLOOKUP($D$2,Females!$A$3:$CN$68,'Chart data'!B15+1,FALSE)","v":40762}]
[1993,13,12,{"$f":"-VLOOKUP($D$2,Males!$A$3:$CN$68,'Chart data'!B16+1,FALSE)","v":-44582},{"$f":"VLOOKUP($D$2,Females!$A$3:$CN$68,'Chart data'!B16+1,FALSE)","v":42130}]
[1994,14,13,{"$f":"-VLOOKUP($D$2,Males!$A$3:$CN$68,'Chart data'!B17+1,FALSE)","v":-45545},{"$f":"VLOOKUP($D$2,Females!$A$3:$CN$68,'Chart data'!B17+1,FALSE)","v":43476}]
[1995,15,14,{"$f":"-VLOOKUP($D$2,Males!$A$3:$CN$68,'Chart data'!B18+1,FALSE)","v":-46819},{"$f":"VLOOKUP($D$2,Females!$A$3:$CN$68,'Chart data'!B18+1,FALSE)","v":43879}]
[1996,16,15,{"$f":"-VLOOKUP($D$2,Males!$A$3:$CN$68,'Chart data'!B19+1,FALSE)","v":-46229},{"$f":"VLOOKUP($D$2,Females!$A$3:$CN$68,'Chart data'!B19+1,FALSE)","v":43894}]
[1997,17,16,{"$f":"-VLOOKUP($D$2,Males!$A$3:$CN$68,'Chart data'!B20+1,FALSE)","v":-48685},{"$f":"VLOOKUP($D$2,Females!$A$3:$CN$68,'Chart data'!B20+1,FALSE)","v":46361}]
{"$rows_left_out":77}
{"sheet":"Males","index":3,"n_rows":68,"n_cols":94,"rows_kept":68,"cut":false,"hidden":false,"merged":[[67,0,67,1],[0,0,0,1]]}
["Scotland",null,null,null,null,null,null,null,null,null,null,null,null,null,null,null,null,null,null,null,null,null,null,null,null,null,null,null,null,null,null,null,null,null,null,null,null,null,null,null,null,null,null,null,null,null,null,null,null,null,null,null,null,null,null,null,null,null,null,null,null,null,null,null,null,null,null,null,null,null,null,null,null,null,null,null,null,null,null,null,null,null,null,null,null,null,null,null,null,null,null,null,null,"Scotland"]
[]
["Males",0,1,2,3,4,5,6,7,8,9,10,11,12,13,14,15,16,17,18,19,20,21,22,23,24,25,26,27,28,29,30,31,32,33,34,35,36,37,38,39,40,41,42,43,44,45,46,47,48,49,50,51,52,53,54,55,56,57,58,59,60,61,62,63,64,65,66,67,68,69,70,71,72,73,74,75,76,77,78,79,80,81,82,83,84,85,86,87,88,89,"90+",null,"Males"]
[1981,35263,34142,33070,30363,30380,33216,33496,34533,37219,39689,42488,42650,44582,45545,46819,46229,48685,47385,46227,45619,44538,43882,42370,40591,39140,38160,36135,35827,35202,33821,34815,35130,36297,37814,41185,31863,30567,31809,31090,29290,27789,28926,29120,29259,28523,28503,28312,28173,27904,28817,28804,28552,28386,28082,28114,28780,27977,28060,27169,28581,28293,29191,20397,19464,20772,21449,22613,22174,21551,20436,19297,18446,17453,16190,14575,13257,11868,10509,9246,7975,6783,5731,4499,3633,3019,2471,2042,1639,1250,968,2712,null,1981]
[1982,34004,35011,33963,32932,30336,30346,33124,33369,34367,37043,39537,42220,42438,44348,45380,46606,45715,48201,47000,45953,45553,44261,43419,41711,39956,38512,37744,35821,35555,34855,33562,34565,34951,36031,37577,40943,31628,30396,31556,30938,29149,27644,28755,28997,29127,28315,28319,28117,27934,27635,28561,28569,28281,28069,27759,27759,28381,27485,27568,26629,28013,27644,28494,19818,18881,20130,20697,21749,21205,20504,19381,18215,17289,16254,15013,13388,12061,10741,9445,8225,7007,5885,4915,3786,3029,2486,1985,1642,1291,950,2732,null,1982]
[1983,33411,33690,34821,33747,32788,30258,30262,33050,33233,34266,36989,39422,42012,42233,44151,45118,46159,45109,47550,46525,45782,45271,43890,42783,41043,39450,37940,37513,35416,35188,34596,33354,34224,34678,35763,37279,40738,31423,30229,31297,30804,28961,27510,28596,28895,28934,28239,28126,27908,27769,27388,28304,28315,27954,27754,27367,27362,27888,27005,27000,26018,27420,26937,27760,19191,18245,19414,19899,20856,20241,19484,18294,17117,16154,15088,13822,12259,10931,9659,8461,7242,6128,5100,4194,3157,2532,2049,1609,1318,1002,2764,null,1983]
[1984,32620,33177,33516,34695,33680,32746,30185,30209,32935,33216,34196,36878,39307,41866,42053,43982,44744,45717,44629,47210,46472,45559,44882,43311,42279,40631,39001,37794,37217,35229,34927,34450,33075,34082,34521,35644,37104,40570,31296,30144,31251,30681,28870,27395,28511,28723,28874,28108,27947,27714,27593,27196,28088,28068,27662,27474,26984,26964,27427,26578,26512,25476,26813,26223,27038,18626,17633,18656,19098,19904,19249,18476,17224,16042,15042,13918,12635,11108,9857,8638,7474,6347,5340,4376,3553,2627,2071,1658,1266,1036,2850,null,1984]
[1985,33374,32323,32887,33291,34533,33537,32727,30144,30122,32822,33125,34089,36778,39147,41703,41858,43620,44329,45183,44188,46975,46033,44950,44090,42667,41661,40096,38708,37498,36916,35033,34725,34347,32875,33930,34412,35502,36952,40436,31231,30116,31197,30610,28796,27279,28344,28610,28751,27972,27817,27530,27433,27005,27849,27837,27370,27166,26555,26575,27019,26066,25949,24918,26177,25507,26257,17967,16950,17941,18298,18917,18214,17368,16085,14914,13918,12779,11524,10037,8831,7679,6583,5533,4632,3734,2984,2144,1670,1323,977,2990,null,1985]
[1986,34047,33140,32140,32757,33223,34388,33443,32608,30131,30083,32700,33010,33949,36681,39011,41506,41584,43239,43777,44893,44078,46513,45300,44130,43414,42145,41040,39771,38357,37085,36555,34781,34488,34092,32568,33786,34151,35299,36721,40191,31082,29960,31073,30527,28688,27086,28209,28429,28520,27823,27606,27320,27174,26737,27533,27516,27043,26707,26104,26097,26518,25570,25350,24248,25468,24704,25423,17238,16239,17132,17396,17906,17136,16284,14972,13749,12761,11593,10343,8913,7820,6716,5709,4754,3897,3086,2424,1701,1303,1009,2940,null,1986]
[1987,33500,33806,32888,31927,32568,33070,34275,33282,32559,30045,30062,32601,32862,33858,36534,38901,41333,41193,42736,43421,44738,43682,45842,44364,43265,42581,41630,40611,39288,37800,36622,36242,34475,34254,33706,32310,33557,33985,35089,36566,39961,30955,29811,30940,30379,28471,26997,28056,28275,28328,27642,27420,27128,26907,26467,27225,27154,26661,26360,25686,25687,26062,25039,24746,23596,24747,23891,24597,16561,15581,16394,16518,16949,16094,15189,13914,12679,11664,10483,9266,7934,6911,5870,4979,4068,3283,2540,1961,1342,1022,2985,null,1987]
[1988,34131,33098,33522,32581,31678,32337,32915,34136,33118,32537,29946,30016,32422,32715,33738,36370,38654,40827,40604,42313,43125,44118,42694,44397,43085,42068,41493,40845,39942,38624,37191,36137,35900,34094,33869,33395,31995,33280,33770,34836,36350,39757,30841,29633,30847,30110,28281,26797,27872,28086,28110,27454,27233,26883,26633,26210,26934,26819,26333,25993,25256,25235,25590,24551,24136,22960,23980,23071,23656,15853,14877,15612,15596,15955,15053,14119,12858,11641,10638,9457,8268,7031,6035,5065,4258,3448,2734,2069,1526,1040,3059,null,1988]
[1989,32885,34156,33129,33597,32617,31753,32376,32964,34200,33191,32602,30054,30083,32417,32719,33696,36212,38222,40295,40217,42004,42623,43389,41610,43254,42131,41211,41025,40347,39655,38285,36894,35909,35709,33928,33819,33311,31882,33224,33650,34754,36330,39748,30840,29623,30723,30021,28219,26703,27808,27956,27962,27314,27111,26743,26430,25983,26661,26571,26047,25659,24929,24797,25128,24028,23550,22382,23238,22330,22759,15179,14201,14836,14737,14969,14025,13102,11824,10641,9694,8540,7368,6158,5204,4359,3594,2888,2250,1664,1186,3154,null,1989]
[1990,32541,32794,34184,33208,33647,32657,31822,32460,33045,34281,33296,32674,30169,30150,32373,32735,33515,35965,37910,40285,40299,41800,42132,42574,40901,42443,41565,40834,40731,40188,39530,38251,36828,35747,35653,33946,33815,33297,31866,33202,33596,34779,36338,39688,30835,29527,30681,29883,28083,26571,27713,27840,27839,27160,26960,26561,26213,25697,26397,26236,25651,25310,24452,24288,24595,23383,22863,21640,22406,21454,21710,14453,13434,13953,13785,13899,12907,11984,10711,9574,8660,7541,6409,5253,4425,3603,2979,2263,1821,1278,3271,null,1990]
[1991,33658,32227,32676,34103,33143,33613,32643,31830,32459,33041,34304,33322,32668,30202,30173,32327,32486,33200,35570,37894,40461,40199,41367,41563,41959,40329,41802,41163,40471,40331,39901,39365,38077,36596,35652,35592,33801,33778,33201,31753,33156,33549,34710,36291,39652,30680,29464,30572,29755,27949,26423,27567,27694,27648,26976,26787,26308,25900,25450,26068,25890,25270,24900,23920,23761,23998,22727,22094,20907,21492,20567,20673,13693,12701,13068,12853,12944,11874,11002,9724,8590,7696,6601,5592,4496,3776,3046,2489,1853,1490,3329,null,1991]
[1992,33922,33472,32198,32637,34030,33121,33544,32646,31824,32306,32900,34217,33237,32502,29960,29897,31944,32164,32837,36129,38134,40289,39703,40597,40788,41448,39856,41495,40917,40120,40049,39672,39076,37902,36470,35635,35516,33756,33774,33204,31819,33128,33543,34740,36280,39522,30645,29401,30440,29679,27825,26350,27444,27549,27517,26789,26579,26064,25654,25129,25721,25459,24803,24383,23366,23129,23302,21959,21287,20044,20520,19601,19606,12913,11955,12099,11929,11955,10870,9981,8729,7667,6785,5687,4801,3808,3166,2518,2026,1514,3704,null,1992]
[1993,32624,33843,33430,32291,32654,34040,33170,33582,32747,31830,32190,32809,34152,33181,32352,29746,29604,31600,31772,33546,36328,38106,39963,39220,40034,40357,41145,39641,41283,40678,40002,40024,39590,38984,37871,36509,35689,35481,33791,33846,33275,31867,33143,33599,34743,36238,39509,30630,29328,30419,29593,27734,26264,27334,27413,27372,26609,26363,25776,25348,24780,25318,24998,24264,23800,22777,22463,22520,21152,20445,19142,19559,18653,18495,12096,11061,11157,10969,10890,9848,8984,7755,6746,5934,4920,4070,3186,2603,2028,1608,3936,null,1993]
[1994,32108,32605,33837,33474,32402,32700,34107,33263,33670,32920,31850,32168,32675,34132,33176,32250,29555,29331,31405,32578,33973,36332,37911,39375,38769,39633,39979,41016,39506,41123,40524,40025,39974,39509,38911,37883,36597,35821,35498,33837,33964,33284,31994,33171,33685,34759,36251,39452,30627,29270,30352,29538,27654,26134,27208,27236,27155,26356,26114,25498,25010,24432,24861,24477,23682,23204,22055,21708,21682,20282,19598,18247,18549,17669,17391,11250,10278,10300,10038,9870,8836,8043,6799,5863,5045,4204,3420,2612,2098,1613,4122,null,1994]
[1995,30808,31935,32482,33794,33494,32398,32626,34064,33302,33691,32981,31850,32061,32493,33998,33110,32058,29270,29096,32311,32835,33878,35850,37189,38549,38128,39128,39682,40715,39201,40851,40309,39784,39852,39214,38707,37790,36577,35816,35455,33922,33912,33248,32034,33171,33606,34767,36182,39354,30548,29207,30257,29431,27497,25969,27055,26989,26900,26095,25847,25221,24623,24041,24368,23928,23117,22612,21327,20967,20932,19437,18768,17343,17522,16687,16355,10532,9452,9464,9197,8910,7957,7176,5961,5106,4306,3565,2880,2146,1706,4424,null,1995]
[1996,30016,30705,31747,32413,33630,33455,32381,32600,33979,33259,33602,32967,31757,31869,32312,33876,32901,31740,28930,29860,32449,32627,33257,34890,36237,37792,37415,38638,39185,40246,38835,40512,39971,39624,39572,39019,38427,37594,36447,35652,35318,33843,33818,33183,32000,33056,33522,34661,36049,39178,30411,29104,30096,29228,27352,25788,26788,26691,26638,25767,25518,24886,24186,23553,23845,23337,22465,21918,20614,20118,20036,18540,17821,16414,16515,15684,15264,9742,8674,8595,8281,7978,7056,6254,5172,4374,3666,2947,2381,1682,4625,null,1996]
[1997,30648,29887,30576,31552,32235,33523,33454,32455,32576,33899,33268,33562,33029,31721,31698,32101,33644,32577,31400,29713,29963,32152,31926,32166,33917,35387,37073,36751,38170,38749,39853,38508,40227,39687,39435,39408,38815,38177,37418,36380,35605,35254,33775,33768,33163,31969,32941,33390,34585,35909,39050,30328,28954,29916,29046,27174,25557,26523,26416,26393,25441,25198,24531,23785,23038,23239,22726,21827,21224,19924,19298,19192,17673,16844,15463,15531,14636,14167,9032,7869,7800,7403,7075,6193,5437,4424,3681,3081,2455,1902,4837,null,1997]
{"$rows_left_out":49}
{"sheet":"Females","index":4,"n_rows":68,"n_cols":94,"rows_kept":68,"cut":false,"hidden":false,"merged":[[67,0,67,2],[0,0,0,1],[0,93,0,94]]}
["Scotland",null,null,null,null,null,null,null,null,null,null,null,null,null,null,null,null,null,null,null,null,null,null,null,null,null,null,null,null,null,null,null,null,null,null,null,null,null,null,null,null,null,null,null,null,null,null,null,null,null,null,null,null,null,null,null,null,null,null,null,null,null,null,null,null,null,null,null,null,null,null,null,null,null,null,null,null,null,null,null,null,null,null,null,null,null,null,null,null,null,null,null,null,"Scotland"]
[]
["Females",0,1,2,3,4,5,6,7,8,9,10,11,12,13,14,15,16,17,18,19,20,21,22,23,24,25,26,27,28,29,30,31,32,33,34,35,36,37,38,39,40,41,42,43,44,45,46,47,48,49,50,51,52,53,54,55,56,57,58,59,60,61,62,63,64,65,66,67,68,69,70,71,72,73,74,75,76,77,78,79,80,81,82,83,84,85,86,87,88,89,"90+",null,"Females"]
[1981,33266,32581,30995,29205,28643,31299,32077,32738,35159,38287,40381,40762,42130,43476,43879,43894,46361,45919,44822,44173,43551,42042,41338,39828,38152,36938,35674,35386,34628,33546,34373,34566,35848,37513,40860,31690,30464,31699,31623,30073,28733,30091,30063,30039,30199,29952,29638,29182,29375,30708,30663,30963,30613,30046,30446,31183,30244,30754,30260,31972,33018,34812,25021,23992,25461,27038,29028,28901,27871,27091,26582,26267,25504,24442,22638,22099,20717,19414,17730,16297,15094,13650,11349,10014,8759,7686,6187,5156,4329,3371,10859,null,1981]
[1982,32590,33052,32426,30878,29106,28565,31176,32018,32632,35105,38180,40300,40715,42078,43396,43817,43772,46126,45692,44627,43842,43035,41667,40636,39247,37766,36680,35398,35215,34407,33425,34272,34401,35699,37397,40710,31540,30398,31658,31527,29926,28632,29939,29951,29926,30089,29818,29525,29085,29259,30532,30499,30766,30400,29838,30230,30915,30018,30426,29959,31627,32581,34313,24612,23580,24976,26500,28375,28185,27094,26247,25740,25326,24459,23411,21600,20950,19513,18162,16512,15013,13797,12380,10144,8905,7687,6649,5221,4256,3509,10977,null,1982]
[1983,31699,32325,32902,32279,30845,29069,28512,31186,31934,32545,35073,38094,40311,40639,42010,43334,43702,43587,45839,45305,44419,43420,42568,40998,40095,38879,37419,36479,35044,34990,34156,33264,34102,34224,35595,37231,40577,31396,30311,31608,31413,29798,28523,29836,29878,29832,29940,29651,29395,28941,29095,30355,30339,30552,30180,29637,29958,30630,29763,30088,29634,31235,32152,33807,24163,23106,24461,25926,27682,27436,26316,25418,24846,24334,23425,22348,20465,19762,18325,16990,15328,13781,12556,11217,9029,7859,6670,5711,4385,3480,11429,null,1983]
[1984,31049,31619,32197,32825,32164,30814,29059,28501,31080,31916,32486,35030,38008,40230,40588,41966,43293,43554,43318,45623,45244,44227,43014,42150,40610,39873,38699,37303,36383,35059,34797,34108,33125,33967,34127,35597,37115,40501,31298,30231,31532,31285,29678,28425,29732,29800,29751,29810,29553,29287,28810,28951,30162,30180,30367,29982,29395,29716,30368,29468,29716,29298,30825,31655,33308,23729,22639,23945,25364,27006,26667,25522,24543,23934,23389,22418,21300,19363,18641,17124,15780,14209,12614,11417,10087,7956,6881,5739,4871,3610,11707,null,1984]
[1985,32064,30811,31362,31987,32623,32063,30727,29000,28372,31042,31865,32454,34966,37962,40168,40554,41863,43087,43184,42917,45397,44800,43642,42266,41711,40265,39617,38465,37217,36218,34931,34718,34009,33028,33938,34082,35548,37082,40462,31245,30188,31434,31201,29589,28361,29579,29728,29696,29673,29456,29165,28678,28818,29979,30031,30171,29756,29154,29465,30064,29180,29358,28926,30400,31105,32783,23230,22147,23393,24727,26233,25833,24683,23630,22958,22373,21356,20196,18284,17510,15929,14561,13022,11437,10289,8995,6967,5989,4898,4078,12008,null,1985]
[1986,32301,31946,30665,31178,31930,32504,32001,30669,28907,28306,30946,31749,32390,34843,37875,40091,40479,41672,42812,42873,42835,45012,44195,42875,41614,41292,39939,39389,38294,37004,35973,34748,34540,33817,32856,33774,33924,35445,36942,40317,31148,30062,31308,31129,29458,28246,29470,29623,29558,29516,29311,29009,28522,28638,29775,29860,29958,29484,28896,29125,29728,28841,28945,28530,29963,30548,32153,22674,21631,22771,23994,25381,24919,23732,22628,21890,21248,20201,18991,17072,16286,14651,13301,11777,10244,9134,7901,5943,5040,4047,12267,null,1986]
[1987,31984,32196,31753,30452,31078,31798,32342,31921,30593,28860,28270,30915,31658,32324,34744,37766,40035,40316,41545,42652,42747,42511,44341,43400,42173,41100,40888,39652,39072,38073,36819,35846,34614,34361,33681,32733,33638,33806,35325,36810,40242,31055,29995,31170,31046,29411,28130,29384,29503,29444,29394,29173,28868,28354,28476,29572,29686,29725,29246,28658,28867,29433,28517,28524,28108,29493,30019,31542,22130,21110,22135,23290,24544,24049,22836,21672,20895,20178,19075,17862,15933,15140,13517,12158,10681,9172,8123,6962,5061,4225,13042,null,1987]
[1988,32099,31686,31955,31457,30253,30918,31633,32200,31778,30470,28816,28240,30825,31579,32210,34661,37606,39793,39985,41170,42415,42217,41700,43192,42500,41384,40409,40401,39259,38686,37744,36542,35621,34438,34182,33532,32629,33483,33709,35166,36659,40064,30885,29867,31049,30889,29290,28025,29243,29394,29309,29248,29030,28744,28220,28268,29416,29485,29459,28985,28388,28569,29083,28174,28123,27663,29004,29370,30854,21563,20572,21502,22598,23654,23120,21870,20647,19894,19075,17942,16670,14779,13962,12318,10950,9543,8101,7165,5986,4269,13641,null,1988]
[1989,31303,32068,31801,32001,31504,30251,30992,31756,32308,31862,30554,28936,28289,30853,31605,32257,34646,37500,39572,39780,40957,42133,41667,40922,42434,42089,41182,40424,40466,39216,38693,37801,36753,35663,34463,34266,33589,32720,33521,33756,35222,36689,40110,30924,29862,31061,30859,29284,28011,29206,29354,29253,29215,28953,28702,28175,28139,29309,29316,29317,28809,28207,28344,28749,27888,27737,27285,28506,28848,30140,21055,20058,20877,21896,22791,22223,20926,19580,18835,17995,16754,15442,13590,12722,11143,9864,8498,7148,6253,5115,14233,null,1989]
[1990,31080,31284,32135,31868,32075,31598,30337,31073,31822,32415,32013,30636,29026,28353,30892,31645,32253,34531,37268,39760,40031,40946,41871,41276,40757,42421,42209,41297,40602,40665,39473,38823,37987,36944,35824,34626,34326,33693,32776,33579,33817,35247,36751,40081,30929,29836,31012,30818,29233,27969,29167,29302,29204,29121,28827,28576,28021,27942,29092,29088,29081,28558,27891,28045,28350,27468,27233,26833,27896,28196,29332,20499,19453,20106,21092,21833,21116,19863,18457,17698,16745,15489,14065,12313,11426,9842,8705,7365,6066,5285,14881,null,1990]
[1991,32083,31006,31236,32103,31868,32089,31575,30314,31036,31800,32468,32027,30661,29051,28345,30898,31619,32141,34081,37231,39892,39902,40721,41551,41089,40733,42409,42233,41452,40643,40778,39612,38890,38057,36986,35816,34617,34374,33675,32763,33555,33814,35237,36753,40033,30904,29797,30988,30778,29149,27857,29060,29208,29093,28958,28685,28429,27874,27730,28849,28840,28802,28240,27540,27644,27917,27036,26712,26264,27234,27502,28560,19818,18777,19354,20323,20869,20101,18783,17347,16543,15569,14294,12809,11076,10222,8756,7623,6376,5178,16130,null,1991]
[1992,32611,32040,30948,31155,32049,31823,32060,31616,30335,30988,31683,32457,32040,30640,29002,28328,30769,31510,31797,34925,37701,39815,39518,40239,41009,40916,40573,42278,42185,41465,40567,40706,39607,38895,38132,36993,35875,34666,34339,33694,32772,33559,33823,35244,36732,39958,30881,29769,30974,30709,29119,27793,28984,29133,28993,28859,28531,28295,27723,27547,28656,28573,28471,27888,27175,27195,27461,26504,26179,25654,26516,26713,27666,19159,18081,18517,19463,19857,19022,17697,16260,15391,14443,13101,11603,9949,9034,7703,6635,5460,16975,null,1992]
[1993,31396,32557,32076,31004,31103,32077,31845,32062,31720,30393,30956,31636,32511,32056,30644,28998,28274,30681,31349,32951,35479,37910,39655,39116,39961,40832,40893,40700,42314,42229,41562,40673,40763,39678,39038,38242,37007,35917,34736,34403,33729,32777,33612,33857,35173,36718,39935,30835,29768,30952,30688,29093,27762,28902,29043,28894,28693,28451,28162,27561,27314,28422,28254,28136,27515,26775,26702,26967,25964,25646,24984,25795,25943,26749,18473,17321,17672,18490,18765,17954,16524,15091,14162,13213,11937,10471,8774,7891,6684,5669,17782,null,1993]
[1994,30702,31378,32519,32101,31091,31150,32116,31914,32121,31879,30495,30928,31601,32451,32082,30638,28999,28277,30667,32655,33674,35707,37868,39268,38855,39929,40847,41073,40912,42401,42361,41747,40819,40878,39774,39122,38371,37104,36014,34824,34496,33747,32763,33623,33919,35173,36682,39944,30806,29799,30934,30684,29025,27666,28808,28947,28749,28544,28315,27991,27375,27151,28164,27944,27791,27148,26312,26191,26402,25400,24986,24271,25017,25147,25785,17765,16538,16795,17517,17644,16798,15295,13981,12957,11980,10796,9299,7633,6786,5713,18360,null,1994]
[1995,29426,30575,31323,32419,32070,31060,31155,32060,31908,32117,31972,30508,30868,31524,32402,32081,30610,28873,28292,32138,33343,33764,35523,37414,38935,38649,39827,40828,41084,40982,42342,42423,41880,40847,40872,39737,39199,38382,37182,36050,34801,34494,33758,32757,33627,33912,35112,36588,39877,30786,29735,30858,30607,28930,27607,28704,28811,28572,28388,28176,27829,27163,26911,27880,27628,27361,26751,25802,25649,25825,24803,24328,23515,24235,24283,24777,17035,15741,15934,16527,16630,15686,14196,12883,11750,10842,9692,8224,6689,5877,19147,null,1995]
[1996,28495,29250,30389,31181,32257,32046,30963,31045,31950,31862,32067,31976,30467,30756,31394,32318,32000,30527,28762,29533,32542,33278,33462,34857,36848,38611,38265,39525,40694,41053,40857,42220,42377,41850,40809,40763,39590,39097,38351,37192,36029,34745,34480,33690,32709,33557,33859,35056,36498,39737,30715,29670,30767,30505,28759,27541,28579,28649,28382,28176,27966,27619,26933,26640,27567,27225,26931,26278,25217,25101,25227,24080,23714,22791,23390,23332,23762,16275,14896,15009,15507,15487,14528,13022,11690,10573,9660,8576,7136,5725,19731,null,1996]
[1997,28992,28431,29097,30282,31005,32115,31941,30952,30962,31898,31833,32021,31988,30406,30643,31265,32181,31930,30346,30077,29947,32290,32947,32498,34246,36520,38253,38064,39359,40664,40976,40792,42129,42308,41865,40781,40719,39490,39076,38298,37158,35961,34668,34423,33637,32674,33515,33812,34968,36384,39617,30617,29616,30667,30401,28619,27411,28426,28456,28237,27983,27713,27400,26645,26330,27203,26822,26478,25821,24645,24502,24604,23394,23042,22034,22491,22377,22768,15474,14061,14049,14465,14354,13349,11868,10560,9410,8534,7453,6165,20170,null,1997]
{"$rows_left_out":48}